{"text_format":"1","workbook":"xlsx","n_sheets":27,"sheets":["Cover","AD ST History","Contents","1-Introduction","2-Instructions","Default Feedstock Inputs List","3-Digester Inputs","4-Emissions Inputs","5-Annual Summary","6-Biogas Production","7-Digestate Production","8-Emission Reductions","9-Feedstock Characteristics","10-Feedstock Toxicity Info","11-Calibration Factors","12-OrganEcs Input Sheet","13-MCF","14-References","15-Help","16-Methodology","17-Manure Related Reductions","18-Other Wastes Reductions","19-Storage","20-Methane Gen. & Utilization","21-Electricity Use","22-Flaring & Leakage","23-Look up values"],"not_rendered":{"charts":2,"images":2,"macros":1,"external_links":0,"defined_names":175,"comments":0,"pivot_tables":0},"unopened":[],"bounds":{"document_bytes":16777216,"sheet_cells":100000,"rows_first":2000,"rows_last":500,"rows_between":2000,"halvings":0,"cell_chars":16384,"cell_head_chars":4096},"cells_cut":0,"cells_raw":0,"read":"whole","date_system":"1900"}

{"sheet":"Cover","index":0,"n_rows":124,"n_cols":4,"rows_kept":124,"cut":false,"hidden":false,"merged":[]}
[]
[]
[]
[]
[]
[]
[]
[]
{"$rows_left_out":117}
{"sheet":"AD ST History","index":1,"n_rows":1,"n_cols":1,"rows_kept":1,"cut":false,"hidden":false,"merged":[]}
["Anaerobic Digestion Screening Tool History"]

{"sheet":"Contents","index":2,"n_rows":19,"n_cols":2,"rows_kept":19,"cut":false,"hidden":true,"merged":[]}
[null,"Content"]
[]
[null,"Introduction"]
[null,"Instructions"]
[null,"Tool Concept Notes"]
[null,"Default Feedstocks Inputs List"]
[null,"Gas to Volume"]
[null,"Digester Inputs"]
{"$rows_left_out":12}
{"sheet":"1-Introduction","index":3,"n_rows":1,"n_cols":1,"rows_kept":1,"cut":false,"hidden":false,"merged":[]}
["Introduction to the Anaerobic Digestion (AD) Screening Tool"]

{"sheet":"2-Instructions","index":4,"n_rows":1,"n_cols":1,"rows_kept":1,"cut":false,"hidden":false,"merged":[]}
["Tool Instructions"]

{"sheet":"Default Feedstock Inputs List","index":5,"n_rows":32,"n_cols":10,"rows_kept":32,"cut":false,"hidden":true,"merged":[[2,1,2,9]]}
[null,"Default Feedstocks Inputs List"]
[]
[null,"This sheet lists all default Feedstocks inputs available for the user to select.\n"]
[null,"Fruit and Vegetable Feedstocks","Livestock Excreted Feedstocks","Other Organic Municipal Feedstocks","Kitchen Feedstocks and Food Scraps","Energy and Cash Crops","Garden Feedstock","Dairy Feedstocks","Seafood Feedstock Silages","Other Inputs"]
[null,"Alfalfa","Adolescents Pigs","Composite Wastewater","Boiled Rice","Agave (Agave sisalana)","Water Hyacinths","Dairy Wastewater","Cuttle Fish Waste Silage","Added Water"]
[null,"Bananas","Boar (200 kg.)","Corrugated Cardboard","Bread Feedstocks","De-oiled Cake","Branches","Whey - Acid Cheese","Mackerel Fish Waste Silage"]
[null,"Broccoli","Broiler Chicken","Diverted Municipal Waste (All Organics)","Brewery Grain Feedstocks","Palms (Decanter Cake)","Grass","Whey - Sweet Cheese","Pacific Saury Fish Waste Silage"]
[null,"Cabbage","Calf","Diverted Municipal Waste (Food Only)","Cooked Meat","Palms (Empty Fruit)","Leaves"]
{"$rows_left_out":25}
{"sheet":"3-Digester Inputs","index":6,"n_rows":151,"n_cols":57,"rows_kept":151,"cut":false,"hidden":false,"merged":[[13,0,13,4],[14,0,14,4],[39,4,39,5],[34,4,34,5],[38,4,38,5],[13,5,13,14],[95,2,95,6],[14,5,14,16],[53,1,53,3],[44,1,44,2],[43,1,43,2],[41,3,41,5],[33,4,33,5],[35,4,35,5],[36,4,36,5],[37,4,37,5],[40,4,40,5],[43,4,43,5],[44,4,44,5],[42,4,42,5]]}
["Anaerobic Digester Feedstock Inputs"]
[]
[]
[null,"Project Name"]
[null,"City/Municipality"]
[null,"Country"]
[]
[null,"General Information & Questions","Answer"]
{"$rows_left_out":144}
{"sheet":"4-Emissions Inputs","index":7,"n_rows":78,"n_cols":4,"rows_kept":78,"cut":false,"hidden":false,"merged":[[9,0,9,3],[19,0,19,3],[31,0,31,3],[24,0,24,3],[46,0,46,3],[11,3,13,3],[15,3,17,3],[26,3,29,3],[21,3,22,3]]}
["Anaerobic Digester Emissions Calculation Inputs"]
[]
[]
[]
[]
[]
[]
[]
{"$rows_left_out":71}
{"sheet":"5-Annual Summary","index":8,"n_rows":45,"n_cols":37,"rows_kept":45,"cut":false,"hidden":false,"merged":[[18,5,18,9],[19,5,19,9],[20,5,20,9],[21,5,21,9],[18,1,18,3],[19,1,19,3],[20,1,20,3],[21,1,21,3],[12,5,12,9],[13,5,13,9],[14,5,14,9],[15,5,15,9],[6,5,6,9],[7,5,7,9],[8,5,8,9],[9,5,9,9],[10,5,10,9],[44,6,44,9],[1,0,5,9],[23,0,27,9],[28,6,28,9],[16,5,16,9],[17,5,17,9],[9,1,9,3],[10,1,10,3],[11,1,11,3],[12,1,12,3],[13,1,13,3],[14,1,14,3],[15,1,15,3],[16,1,16,3],[17,1,17,3],[11,5,11,9]]}
["Annual Output Summary Information"]
["The table below shows the planned Anaerobic Digester’s annual digestate and biogas production and options for energy recovery based on the user’s inputs, calculated by taking the daily production and multiplying it by 365 days per year. This should be considered a first-order estimate. In reality, anaerobic digester production may vary based on waste characteristics, reactor temperature, system design limitations, and daily operations. "]
[]
[]
[]
[]
["Biogas Production - \nThe estimated low and high production values use calibration factors from actual observations that represent the 25th and 75th percentile values of the ratio between measured and modeled data. These values are used to adjust the maximum potential biogas generation values to estimate the likely biogas generation potential values. ","Estimated Value (low)","Estimated Value (high)","Theoretical Maximum Potential","Unit","Notes",null,null,null,null,null,null,null,null,null,null,null,null,null,null,null,null,null,null,null,null,null,null,null,null,null,null,null,null,"Estimated Biogas Production - low (m3/year)","Estimated Biogas Production - high (m3/year)","Maximum Potential (m3/year)"]
["Annual Biogas Production",{"$f":"IFERROR(($D$8*VLOOKUP(ReactorType&\"_\"&ReactorTemp,'11-Calibration Factors'!$A$4:$C$9,2,FALSE)),\" \")","v":0},{"$f":"IFERROR(($D$8*VLOOKUP(ReactorType&\"_\"&ReactorTemp,'11-Calibration Factors'!$A$4:$C$9,3,FALSE)),\" \")","v":0},{"$f":"IFERROR((Estimated_Max_Daily_Biogas_Production*365)*VLOOKUP('5-Annual Summary'!E8,'23-Look up values'!$A$13:$B$14,2,FALSE),\" \")","v":0},"m3/year"]
{"$rows_left_out":38}
{"sheet":"6-Biogas Production","index":9,"n_rows":79,"n_cols":27,"rows_kept":79,"cut":false,"hidden":false,"merged":[[5,0,5,2],[35,0,35,5],[55,21,55,26],[9,0,9,5],[55,14,55,19],[6,2,7,2],[55,0,55,5],[55,7,55,12]]}
["Biogas Production Summary Information"]
[]
[]
[]
[]
["The estimated low and high production values use calibration factors from actual observations that represent the 25th and 75th percentile values of the ratio between measured and modeled data. These values are used to adjust the maximum potential biogas generation values to estimate the likely biogas generation potential values. The total daily biogas and methane production estimates below are an average of the low and high production values."]
["Total Biogas Production ",{"$f":"F53","v":0},"m3/day"]
["Total Methane Production",{"$f":"D53","v":0}]
{"$rows_left_out":72}
{"sheet":"7-Digestate Production","index":10,"n_rows":87,"n_cols":7,"rows_kept":87,"cut":false,"hidden":false,"merged":[[7,0,7,5],[69,0,69,6],[32,0,32,6]]}
["Digestate Production Summary Information"]
[]
[]
[]
[]
["Total Digestate Production",{"$f":"SUM(F50:G50)","v":0},"kg/day"]
[]
[{"$f":"\"Total Digestate Production  (\"&C6&\")\"","v":"Total Digestate Production  (kg/day)"}]
{"$rows_left_out":80}
{"sheet":"8-Emission Reductions","index":11,"n_rows":65,"n_cols":5,"rows_kept":65,"cut":false,"hidden":false,"merged":[]}
["Annual Project Net Emissions"]
[]
[]
[]
[]
[]
[]
["Annual Baseline Emissions (MtCO2e)",{"$f":"IFERROR(SUM(E28:E29),\"-\")","v":0}]
{"$rows_left_out":58}
{"sheet":"9-Feedstock Characteristics","index":12,"n_rows":118,"n_cols":23,"rows_kept":118,"cut":false,"hidden":false,"merged":[[7,19,7,20],[87,1,87,17],[99,1,99,17],[103,1,103,17],[115,1,115,17],[9,1,9,17],[31,1,31,17],[60,1,60,17],[64,1,64,17],[70,1,70,17],[53,22,55,22],[61,21,63,21],[66,21,69,21],[23,21,30,21],[90,21,91,21],[88,21,89,21],[51,21,52,21],[85,21,86,21],[110,21,112,21],[10,21,22,21],[80,21,83,21],[100,21,102,21],[53,21,55,21],[93,21,94,21],[108,21,109,21]]}
["Waste Characteristics"]
[{"$f":"1","v":1},{"$f":"A2+1","v":2},{"$f":"B2+1","v":3},4,5,{"$f":"E2+1","v":6},{"$f":"F2+1","v":7},{"$f":"G2+1","v":8},{"$f":"H2+1","v":9},{"$f":"I2+1","v":10},{"$f":"J2+1","v":11},{"$f":"K2+1","v":12},{"$f":"L2+1","v":13},{"$f":"M2+1","v":14},{"$f":"N2+1","v":15},{"$f":"O2+1","v":16},{"$f":"P2+1","v":17},{"$f":"Q2+1","v":18},null,null,null,{"$f":"R2+1","v":19},{"$f":"V2+1","v":20}]
[]
[]
[]
[]
[]
["Unit","% w.b.","% w.b.","lb./d/1000 lb. ","lb./d/1000 lb. ","% of TS","% w.b.","% w.b.","lb./d/1000 lb. ","lb./d/1000 lb. ","lb./d/1000 lb. ","% w.b.","% of TS","% of TS","% of TS",null,"m3 / Mg of VS","kg/m3",null,"Category"]
{"$rows_left_out":111}
{"sheet":"10-Feedstock Toxicity Info","index":13,"n_rows":114,"n_cols":20,"rows_kept":114,"cut":false,"hidden":false,"merged":[[1,0,2,9],[95,1,95,9],[99,1,99,9],[111,1,111,9],[3,3,3,7],[5,1,5,9],[27,1,27,9],[56,1,56,9],[60,1,60,9],[66,1,66,9],[83,1,83,9]]}
["Waste Toxicity Characteristics"]
["The table below lists waste category and the anaerobic digestion inhibitors commonly associated with that type of waste. Sources for this table include Chen et al. 2007, Lefebvre et al. 2007, and Arinbaatar et al. 2014. Some information was also sourced from the sources listed on the Default Waste Assumptions tab for individual waste types."]
[null,null,null,null,null,null,null,null,null,null,null,null,null,null,null,null,null,null,null,"Light Metals"]
["Inhibitor Category","Ammonia","Sulfides","Light Metals",null,null,null,null,"Heavy Metals","Organic Contaminants"]
["Inhibitor Name or Example","Ammonia Ions, free Ammonia","Sulfides","Aluminum","Calcium","Magnesium","Potassium","Sodium","e.g. Fe, Co, Cu, Zn, Pb, etc.","e.g. Chlorophenols, Halogenated, Alophatics, N-substituted aromatics, LCFAs, and Lignins"]
[null,"Livestock Excreted Feedstocks"]
["Lactating Cow (100 Lb./Day)","✔",null,null,null,null,null,null,null,"✔",null,null,null,null,null,null,null,null,null,{"$f":"COUNTA(D7:H7)","v":0}]
["Calf","✔",null,null,null,null,null,null,null,"✔",null,null,null,null,null,null,null,null,null,0]
{"$rows_left_out":107}
{"sheet":"11-Calibration Factors","index":14,"n_rows":17,"n_cols":3,"rows_kept":17,"cut":false,"hidden":false,"merged":[]}
["Calibration Factors"]
[]
["System Type","Calibration Factor  - low","Calibration Factor  - high"]
["Wet_Mesophilic",0.4008493115035045,0.7304181796609337]
["Wet_Thermophilic",0.57471264367816088,0.57471264367816088]
["Wet_Unheated/Ambient",1.1761938367442956E-2,1.1761938367442956E-2]
["Dry_Mesophilic",0.4008493115035045,0.7304181796609337]
["Dry_Thermophilic",0.57471264367816088,0.57471264367816088]
{"$rows_left_out":10}
{"sheet":"12-OrganEcs Input Sheet","index":15,"n_rows":19,"n_cols":7,"rows_kept":19,"cut":false,"hidden":false,"merged":[[1,0,6,6]]}
["OrganEcs Input Sheet"]
["Instructions:\nThe OrganEcs is a tool for estimating the costs associated with an organic waste management project. It provides planning-level assistance to local governments, waste professionals, policymakers, facility operators, and project developers to help them make financial decisions about their potential organic waste management projects.This sheet allows you the ability to directly copy the results from AD Screening Tool to OrganEcs - Anaerobic Digestion Version 3.1. You may manually enter the results generated in the yellow/blue cells into the “Waste Inputs” tab in OrganEcs. More information about OrganEcs can be accessed at https://www.globalmethane.org/resources/details.aspx?resourceid=5175\n"]
[]
[]
[]
[]
[]
[null,"Yard Waste","Food Waste","Manure","Sewage Sludge","Mixed Paper","Corrugated\nCardboard"]
{"$rows_left_out":12}
{"sheet":"13-MCF","index":16,"n_rows":35,"n_cols":25,"rows_kept":35,"cut":false,"hidden":false,"merged":[[7,2,7,6],[7,7,7,17],[7,18,7,20],[6,2,6,20]]}
["Methane Conversion Factors (MCF)"]
[]
[]
[]
[]
[null,"MCF Values By Temperature for Manure Management Systems"]
[null,null,"Temperature (°C)"]
[null,null,"Cool",null,null,null,null,"Temperate",null,null,null,null,null,null,null,null,null,null,"Warm"]
{"$rows_left_out":28}
{"sheet":"14-References","index":17,"n_rows":73,"n_cols":2,"rows_kept":73,"cut":false,"hidden":false,"merged":[]}
[null,"References and Background Information"]
[]
[null,"Agrawal, Karan, B. R. Barbe, and Shareena Khan. 2009. “Biogas from Pressmud.” IOSR Journal of Mechanical and Civil Engineering, 37–41."]
[null,"Alucilja, Renel M., Pepito M. Bato, Delfin S. Suministrado, and Engelbert K. Peralta. “Determination of Some Physical and Mechanical Properties of Oil Palm Fruit.” USM R&D Journal 21, no. 2 (December 31, 2013): 61–70."]
[null,"Antonopoulou, Georgia, Katerina Stamatelatou, Nikolaos Venetsaneas, Michael Kornaros, and Gerasimos Lyberatos. “Biohydrogen and Methane Production from Cheese Whey in a Two-Stage Anaerobic Process.” Industrial & Engineering Chemistry Research 47, no. 15 (August 1, 2008): 5227–33. https://doi.org/10.1021/ie071622x."]
[null,"Antonopoulou, G, Katerina Stamatelatou, and Gerasimos Lyberatos. Exploitation of Rapeseed and Sunflower Residues for Methane Generation through Anaerobic Digestion: The Effect of Pretreatment. Vol. 20, 2010. https://doi.org/10.3303/CET1020043."]
[null,"Ariunbaatar, Javkhlan, Antonio Panico, Giovanni Esposito, Francesco Pirozzi, and Piet N. L. Lens. “Pretreatment Methods to Enhance Anaerobic Digestion of Organic Solid Waste.” Applied Energy 123 (June 15, 2014): 143–56. https://doi.org/10.1016/j.apenergy.2014.02.035.\n"]
[null,"Bachmann, Nathalie. “Sustainable Biogas Production in Municipal Wastewater Treatment Plants.” IEA Bioenergy, n.d. https://ec.europa.eu/jrc/en/publication/sustainable-biogas-production-municipal-wastewater-treatment-plants."]
{"$rows_left_out":66}
{"sheet":"15-Help","index":18,"n_rows":1,"n_cols":1,"rows_kept":1,"cut":false,"hidden":false,"merged":[]}
["Help"]

{"sheet":"16-Methodology","index":19,"n_rows":1,"n_cols":2,"rows_kept":1,"cut":false,"hidden":false,"merged":[]}
[null,"Tool Concept Notes"]

{"sheet":"17-Manure Related Reductions","index":20,"n_rows":20,"n_cols":6,"rows_kept":20,"cut":false,"hidden":false,"merged":[]}
["Baseline Emissions from Manure"]
[]
["Annual Manure Volatile Solids",null,null,null,null,"Annual Methane Emissions from Manure"]
["Waste Category","Volatile Solids (% d.w.)","Total Volatile Solids (Mg/year)","Max. Methane Production (B0)  m3 / Mg of VS","Methane Conversion Factor (MCF)","kg CH4 per year"]
[{"$f":"'3-Digester Inputs'!B17","v":0},{"$f":"IFERROR(IF(VLOOKUP(A5,Waste_Item_Table,20,FALSE)=\"Y\",('3-Digester Inputs'!H17*100)/(100-'3-Digester Inputs'!H17),\"\"),\"\")","v":""},{"$f":"IFERROR(IF(VLOOKUP(A5,Waste_Item_Table,20,FALSE)=\"Y\",B5*'3-Digester Inputs'!BE17/1000*365,\"\"),\"\")","v":""},{"$f":"IFERROR(IF(VLOOKUP(A5,Waste_Item_Table,20,FALSE)=\"Y\",VLOOKUP(A5,Waste_Item_Table,17),\"\"),\"\")","v":""},{"$f":"IF(B5<>\"\",IFERROR(VLOOKUP(PrimaryManureMang,'13-MCF'!$B$9:$U$32,MATCH(AvgTemp,'13-MCF'!$B$9:$U$9,0),FALSE),0),\"\")","v":""},{"$f":"IF(LEN(B5)>0,VLOOKUP(A5,'6-Biogas Production'!$O$58:$T$72,4,FALSE)*E5*365*ConversionFactor,\"\")","v":""}]
[{"$f":"'3-Digester Inputs'!B18","v":0},{"$f":"IFERROR(IF(VLOOKUP(A6,Waste_Item_Table,20,FALSE)=\"Y\",('3-Digester Inputs'!H18*100)/(100-'3-Digester Inputs'!H18),\"\"),\"\")","v":""},{"$f":"IFERROR(IF(VLOOKUP(A6,Waste_Item_Table,20,FALSE)=\"Y\",B6*'3-Digester Inputs'!BE18/1000*365,\"\"),\"\")","v":""},{"$f":"IFERROR(IF(VLOOKUP(A6,Waste_Item_Table,20,FALSE)=\"Y\",VLOOKUP(A6,Waste_Item_Table,17),\"\"),\"\")","v":""},{"$f":"IF(B6<>\"\",IFERROR(VLOOKUP(PrimaryManureMang,'13-MCF'!$B$9:$U$32,MATCH(AvgTemp,'13-MCF'!$B$9:$U$9,0),FALSE),0),\"\")","v":""},{"$f":"IF(LEN(B6)>0,VLOOKUP(A6,'6-Biogas Production'!$O$58:$T$72,4,FALSE)*E6*365*ConversionFactor,\"\")","v":""}]
[{"$f":"'3-Digester Inputs'!B19","v":0},{"$f":"IFERROR(IF(VLOOKUP(A7,Waste_Item_Table,20,FALSE)=\"Y\",('3-Digester Inputs'!H19*100)/(100-'3-Digester Inputs'!H19),\"\"),\"\")","v":""},{"$f":"IFERROR(IF(VLOOKUP(A7,Waste_Item_Table,20,FALSE)=\"Y\",B7*'3-Digester Inputs'!BE19/1000*365,\"\"),\"\")","v":""},"",{"$f":"IF(B7<>\"\",IFERROR(VLOOKUP(PrimaryManureMang,'13-MCF'!$B$9:$U$32,MATCH(AvgTemp,'13-MCF'!$B$9:$U$9,0),FALSE),0),\"\")","v":""},{"$f":"IF(LEN(B7)>0,VLOOKUP(A7,'6-Biogas Production'!$O$58:$T$72,4,FALSE)*E7*365*ConversionFactor,\"\")","v":""}]
[{"$f":"'3-Digester Inputs'!B20","v":0},{"$f":"IFERROR(IF(VLOOKUP(A8,Waste_Item_Table,20,FALSE)=\"Y\",('3-Digester Inputs'!H20*100)/(100-'3-Digester Inputs'!H20),\"\"),\"\")","v":""},{"$f":"IFERROR(IF(VLOOKUP(A8,Waste_Item_Table,20,FALSE)=\"Y\",B8*'3-Digester Inputs'!BE20/1000*365,\"\"),\"\")","v":""},"",{"$f":"IF(B8<>\"\",IFERROR(VLOOKUP(PrimaryManureMang,'13-MCF'!$B$9:$U$32,MATCH(AvgTemp,'13-MCF'!$B$9:$U$9,0),FALSE),0),\"\")","v":""},{"$f":"IF(LEN(B8)>0,VLOOKUP(A8,'6-Biogas Production'!$O$58:$T$72,4,FALSE)*E8*365*ConversionFactor,\"\")","v":""}]
{"$rows_left_out":13}
{"sheet":"18-Other Wastes Reductions","index":21,"n_rows":20,"n_cols":6,"rows_kept":20,"cut":false,"hidden":false,"merged":[]}
["Baseline Emissions from Co-Digested Waste"]
[]
["Annual Manure Volatile Solids",null,null,null,null,"Annual Methane Emissions from Waste"]
["Waste Category","Volatile Solids (% d.w.)","Total Volatile Solids (Mg/year)","Max. Methane Production (B0)  m3 / Mg of VS","Methane Conversion Factor","kg CH4 per year"]
[{"$f":"IFERROR('3-Digester Inputs'!B17,\"-\")","v":0},{"$f":"IFERROR(IF(VLOOKUP(A5,Waste_Item_Table,20,FALSE)=\"N\",('3-Digester Inputs'!H17*100)/(100-'3-Digester Inputs'!H17),\"\"),\"\")","v":""},{"$f":"IFERROR(IF(VLOOKUP(A5,Waste_Item_Table,20,FALSE)=\"N\",B5*'3-Digester Inputs'!BE17/1000*365,\"\"),\"\")","v":""},{"$f":"IFERROR(IF(VLOOKUP(A5,Waste_Item_Table,20,FALSE)=\"N\",VLOOKUP(A5,Waste_Item_Table,17,FALSE),\"\"),\"\")","v":""},{"$f":"IF(B5<>\"\",IFERROR(VLOOKUP(PrimaryOtherWasteMng,'13-MCF'!$B$9:$U$32,MATCH(AvgTemp,'13-MCF'!$B$9:$U$9,0),FALSE),0),\"\")","v":""},{"$f":"IF(LEN(B5)>0,VLOOKUP(A5,'6-Biogas Production'!$O$58:$T$72,4,FALSE)*365*E5*ConversionFactor,\"\")","v":""}]
[{"$f":"IFERROR('3-Digester Inputs'!B18,\"-\")","v":0},{"$f":"IFERROR(IF(VLOOKUP(A6,Waste_Item_Table,20,FALSE)=\"N\",('3-Digester Inputs'!H18*100)/(100-'3-Digester Inputs'!H18),\"\"),\"\")","v":""},{"$f":"IFERROR(IF(VLOOKUP(A6,Waste_Item_Table,20,FALSE)=\"N\",B6*'3-Digester Inputs'!BE18/1000*365,\"\"),\"\")","v":""},"",{"$f":"IF(B6<>\"\",IFERROR(VLOOKUP(PrimaryOtherWasteMng,'13-MCF'!$B$9:$U$32,MATCH(AvgTemp,'13-MCF'!$B$9:$U$9,0),FALSE),0),\"\")","v":""},{"$f":"IF(LEN(B6)>0,VLOOKUP(A6,'6-Biogas Production'!$O$58:$T$72,4,FALSE)*365*E6*ConversionFactor,\"\")","v":""}]
[{"$f":"IFERROR('3-Digester Inputs'!B19,\"-\")","v":0},{"$f":"IFERROR(IF(VLOOKUP(A7,Waste_Item_Table,20,FALSE)=\"N\",('3-Digester Inputs'!H19*100)/(100-'3-Digester Inputs'!H19),\"\"),\"\")","v":""},{"$f":"IFERROR(IF(VLOOKUP(A7,Waste_Item_Table,20,FALSE)=\"N\",B7*'3-Digester Inputs'!BE19/1000*365,\"\"),\"\")","v":""},"",{"$f":"IF(B7<>\"\",IFERROR(VLOOKUP(PrimaryOtherWasteMng,'13-MCF'!$B$9:$U$32,MATCH(AvgTemp,'13-MCF'!$B$9:$U$9,0),FALSE),0),\"\")","v":""},{"$f":"IF(LEN(B7)>0,VLOOKUP(A7,'6-Biogas Production'!$O$58:$T$72,4,FALSE)*365*E7*ConversionFactor,\"\")","v":""}]
[{"$f":"IFERROR('3-Digester Inputs'!B20,\"-\")","v":0},{"$f":"IFERROR(IF(VLOOKUP(A8,Waste_Item_Table,20,FALSE)=\"N\",('3-Digester Inputs'!H20*100)/(100-'3-Digester Inputs'!H20),\"\"),\"\")","v":""},{"$f":"IFERROR(IF(VLOOKUP(A8,Waste_Item_Table,20,FALSE)=\"N\",B8*'3-Digester Inputs'!BE20/1000*365,\"\"),\"\")","v":""},"",{"$f":"IF(B8<>\"\",IFERROR(VLOOKUP(PrimaryOtherWasteMng,'13-MCF'!$B$9:$U$32,MATCH(AvgTemp,'13-MCF'!$B$9:$U$9,0),FALSE),0),\"\")","v":""},{"$f":"IF(LEN(B8)>0,VLOOKUP(A8,'6-Biogas Production'!$O$58:$T$72,4,FALSE)*365*E8*ConversionFactor,\"\")","v":""}]
{"$rows_left_out":13}
{"sheet":"19-Storage","index":22,"n_rows":20,"n_cols":6,"rows_kept":20,"cut":false,"hidden":false,"merged":[]}
["Temporary Storage Emissions from all Wastes"]
[]
["Annual Manure Volatile Solids",null,null,null,null,"Annual Methane Emissions from Storage"]
["Waste Category","Volatile Solids (% d.w.)","Total Volatile Solids (Mg/day)","Max. Methane Production (B0)  m3 / Mg of VS","Methane Conversion Factor","kg CH4 per year"]
[{"$f":"IFERROR('3-Digester Inputs'!B17,\"-\")","v":0},{"$f":"IFERROR(('3-Digester Inputs'!H17*100)/(100-'3-Digester Inputs'!H17),\"\")","v":""},{"$f":"IFERROR(B5*'3-Digester Inputs'!BE17/1000,\"\")","v":""},{"$f":"IFERROR(VLOOKUP(A5,Waste_Item_Table,17),\"\")","v":""},{"$f":"IF(B5<>\"\",IFERROR(VLOOKUP(StorageMng,'13-MCF'!$B$9:$U$32,MATCH(AvgTemp,'13-MCF'!$B$9:$U$9,0),FALSE),0),\"\")","v":""},{"$f":"IF(LEN(B5)>0,VLOOKUP(A5,'6-Biogas Production'!$O$58:$T$72,4,FALSE)*E5*ConversionFactor*Average_Days_Waste_Stored,\"\")","v":""}]
[{"$f":"IFERROR('3-Digester Inputs'!B18,\"-\")","v":0},{"$f":"IFERROR(('3-Digester Inputs'!H18*100)/(100-'3-Digester Inputs'!H18),\"\")","v":""},{"$f":"IFERROR(B6*'3-Digester Inputs'!BE18/1000,\"\")","v":""},"",{"$f":"IF(B6<>\"\",IFERROR(VLOOKUP(StorageMng,'13-MCF'!$B$9:$U$32,MATCH(AvgTemp,'13-MCF'!$B$9:$U$9,0),FALSE),0),\"\")","v":""},{"$f":"IF(LEN(B6)>0,VLOOKUP(A6,'6-Biogas Production'!$O$58:$T$72,4,FALSE)*E6*ConversionFactor*Average_Days_Waste_Stored,\"\")","v":""}]
[{"$f":"IFERROR('3-Digester Inputs'!B19,\"-\")","v":0},{"$f":"IFERROR(('3-Digester Inputs'!H19*100)/(100-'3-Digester Inputs'!H19),\"\")","v":""},{"$f":"IFERROR(B7*'3-Digester Inputs'!BE19/1000,\"\")","v":""},"",{"$f":"IF(B7<>\"\",IFERROR(VLOOKUP(StorageMng,'13-MCF'!$B$9:$U$32,MATCH(AvgTemp,'13-MCF'!$B$9:$U$9,0),FALSE),0),\"\")","v":""},{"$f":"IF(LEN(B7)>0,VLOOKUP(A7,'6-Biogas Production'!$O$58:$T$72,4,FALSE)*E7*ConversionFactor*Average_Days_Waste_Stored,\"\")","v":""}]
[{"$f":"IFERROR('3-Digester Inputs'!B20,\"-\")","v":0},{"$f":"IFERROR(('3-Digester Inputs'!H20*100)/(100-'3-Digester Inputs'!H20),\"\")","v":""},{"$f":"IFERROR(B8*'3-Digester Inputs'!BE20/1000,\"\")","v":""},"",{"$f":"IF(B8<>\"\",IFERROR(VLOOKUP(StorageMng,'13-MCF'!$B$9:$U$32,MATCH(AvgTemp,'13-MCF'!$B$9:$U$9,0),FALSE),0),\"\")","v":""},{"$f":"IF(LEN(B8)>0,VLOOKUP(A8,'6-Biogas Production'!$O$58:$T$72,4,FALSE)*E8*ConversionFactor*Average_Days_Waste_Stored,\"\")","v":""}]
{"$rows_left_out":13}
{"sheet":"20-Methane Gen. & Utilization","index":23,"n_rows":15,"n_cols":3,"rows_kept":15,"cut":false,"hidden":false,"merged":[]}
["Methane Generation and Utilization"]
[]
[]
["Methane Utilization"]
["Combustion Process","Destruction Efficiency"]
["none",0]
["Lean Burn internal combustion engine",0.93600000000000005]
["Rich Burn internal combustion engine",0.995]
{"$rows_left_out":8}
{"sheet":"21-Electricity Use","index":24,"n_rows":55,"n_cols":9,"rows_kept":55,"cut":false,"hidden":false,"merged":[]}
["Electricity Use Emissions"]
[]
["Electricity Use"]
["Emissions Factor s","Value","Unit"]
["Default Grid Emisisons Factor",{"$f":"'4-Emissions Inputs'!$B$43","v":""},"kgCO2/kWh"]
["User Grid Emissions Factor",{"$f":"IF('4-Emissions Inputs'!B42=\"No\",'4-Emissions Inputs'!B44,0)","v":0},"kgCO2/kWh"]
["CO2 Emissions Factor for Biogas",57.61,"kg/MMBtu"]
["CH4 Emissions Factor for Biogas",{"$f":"1.06/1000","v":1.06E-3},"kg/MMBtu"]
{"$rows_left_out":48}
{"sheet":"22-Flaring & Leakage","index":25,"n_rows":19,"n_cols":3,"rows_kept":19,"cut":false,"hidden":false,"merged":[[2,0,2,1]]}
["Flaring & Leakage Emissions"]
[]
["Flaring"]
["Combustion Process (Ceff)","Value","Units"]
["Open Flare Continuous",0.96]
["Open Flare Non-continuous",0.5]
["Enclosed Flare",0.995]
["User Value",{"$f":"IF('4-Emissions Inputs'!B29=\"No\",'4-Emissions Inputs'!$B$30,\"\")","v":""}]
{"$rows_left_out":12}
{"sheet":"23-Look up values","index":26,"n_rows":102,"n_cols":10,"rows_kept":102,"cut":false,"hidden":true,"merged":[]}
["Lookup Values"]
[]
["Input Units","Conversion",null,null,null,"Feedstock List",null,"General",null,"Specific"]
["kg/day",1,null,null,null,"General",null,"Lactating Cow",null,"Lactating Cow"]
["lb/day",0.453592,null,null,null,"Specific",null,"Calf",null,"Calf"]
["metric tons/day",1000,null,null,null,null,null,"Swine - Gestating (190 kg.)",null,"Heifer"]
["short tons/day",907.18499999999995,null,null,null,null,null,"Swine - Lactating (190 kg.)",null,"Dry Dairy Cow"]
["liters/day",1,null,null,null,null,null,"Adolescents Pigs",null,"Cattle with Primarily Grain/Grass Diet"]
{"$rows_left_out":94}