{"text_format":"1","workbook":"xlsx","n_sheets":16,"sheets":["Cover","OrganEcs History","1-Title","2-Contents","3-Background","4-Instructions","5-Facility Inputs","6-Waste Inputs","7-Economic Inputs","8-Default Values","9-Outputs","10-Compost W.O. FA","11-Compost With FA","12-Tool Assumptions","13-Sources","25-Misc"],"not_rendered":{"charts":4,"images":1,"macros":1,"external_links":4,"defined_names":259,"comments":0,"pivot_tables":0},"unopened":[],"bounds":{"document_bytes":16777216,"sheet_cells":100000,"rows_first":2000,"rows_last":500,"rows_between":2000,"halvings":0,"cell_chars":16384,"cell_head_chars":4096},"cells_cut":0,"cells_raw":0,"read":"whole","date_system":"1900"}

{"sheet":"Cover","index":0,"n_rows":370,"n_cols":3,"rows_kept":370,"cut":false,"hidden":false,"merged":[]}
[]
[]
[]
[]
[]
[]
[]
[]
[]
[]
[]
[]
[]
[]
[]
{"$rows_left_out":356}
{"sheet":"OrganEcs History","index":1,"n_rows":1,"n_cols":1,"rows_kept":1,"cut":false,"hidden":false,"merged":[]}
["OrganEcs Anaerobic Digestion Tool History"]

{"sheet":"1-Title","index":2,"n_rows":7,"n_cols":3,"rows_kept":7,"cut":false,"hidden":false,"merged":[]}
[]
[null,"Title"]
[]
[null,"Title","OrganEcs – Cost Estimating Tool for Managing Source-Separated Organic Waste"]
[null,"Version","3.1 (Compost Edition)"]
[null,"Acknowledgements","OrganEcs, was developed by the U.S. Environmental Protection Agency under the auspices of the Global Methane Initiative and in support of the Climate and Clean Air Coalition. Tom Frankiewicz (EPA’s International Biogas Team Lead) managed the tool’s development with technical support from Abt Associates.\n\nThe U.S. EPA recommends users cite OrganEcs with the following citation when citing the tool in published work: \nU.S. EPA. 2021. OrganEcs-Compost V3.1. "]
[null,"Disclaimer","The tool is meant to provide planning-level assistance, outputs should be verified through a detailed feasibility study (or through the solicitation of bids from qualified proposers) before project development commences."]

{"sheet":"2-Contents","index":3,"n_rows":16,"n_cols":4,"rows_kept":16,"cut":false,"hidden":false,"merged":[]}
[]
[null,"Contents"]
[]
[null,1,null,"Title"]
[null,{"$f":"B4+1","v":2},null,"Contents"]
[null,{"$f":"B5+1","v":3},null,"Background"]
[null,4,null,"Instructions"]
[null,5,null,"Facility Inputs"]
[null,6,null,"Waste Inputs"]
[null,7,null,"Economic Inputs"]
[null,8,null,"Default Values"]
[null,9,null,"Outputs"]
[null,10,null,"Composting Without Forced Aeration-Low"]
[null,11,null,"Composting Without Forced Aeration-High"]
[null,12,null,"Tool Assumptions"]
{"$rows_left_out":2}
{"sheet":"3-Background","index":4,"n_rows":4,"n_cols":4,"rows_kept":4,"cut":false,"hidden":false,"merged":[[3,1,3,2]]}
[]
[null,"Background"]
[]
[null,"Introduction ",null,"The Global Methane Initiative works with cities worldwide to improve solid waste management and reduce emissions of short-lived climate pollutants. OrganEcs, was developed by the U.S. Environmental Protection Agency under the auspices of the Global Methane Initiative and in support of the Climate and Clean Air Coalition. Organic waste management projects (i.e., composting, and anaerobic digestion) represent a key opportunity for achieving these objectives. Planning and development of such projects require a detailed understanding of the costs involved in construction and operation of organic waste management facilities.\n\nOrganEcs is a tool for estimating the costs associated with organic waste management projects. It provides planning-level assistance to local governments, waste professionals, policymakers, facility operators, and project developers to help them make financial decisions about their potential organic projects. Specifically, the tool assists users in determining the expected IRR (internal rate of return), given user inputs for a composting project. \n\nModel outputs should be viewed as preliminary results that can be used for planning purposes. These estimates should be verified through detailed feasibility studies prior to project development, or through the solicitation of bids from qualified firms. "]

{"sheet":"4-Instructions","index":5,"n_rows":16,"n_cols":3,"rows_kept":16,"cut":false,"hidden":false,"merged":[[14,1,14,3],[15,1,15,3],[8,2,8,3],[9,2,9,3],[1,1,1,3],[12,1,12,3],[13,1,13,3],[10,1,10,3],[11,1,11,3],[3,1,3,3],[4,1,4,3],[6,2,6,3],[7,2,7,3],[5,1,5,3]]}
[]
[null,"Instructions"]
[]
[null,"Model Organization"]
[null,"This tool has 13 sheets, which are color coded as follows: \n  •  BLUE tabs: User inputs.\n  •  YELLOW tab: Default values.\n  •  BLACK tab: Results or Outputs.\n  •  GRAY tabs: Organic waste treatment technologies\n  •  GREEN tabs: Assumptions and additional resources. "]
[null,"Operating the Tool"]
[null,"Version Control","•  Download the latest version of OrganEcs\n•  Save the file with the city name before entering any data\n"]
[null,"Cell Colors","•  Input cells are BLUE and will change to a lighter shade when you enter data. \n•  Default cells are YELLOW and will change to brown if they are altered.\n•  Some cells have an automatic validity check. If you enter an incorrect value or make an invalid selection, the cell will turn RED, and an error message will appear. Please correct the error before continuing."]
[null,"Data Entry","•  Enter all required user inputs into the blue cells in the input tabs (“5-Facility Inputs,” “6-Waste Inputs,” and “7-Economic Inputs”). Please fill in all blue tabs in order to receive accurate outputs.\n•  Review the default values on tab \"8-Default Values\" and alter if desired.\n•  Additional instructions and source references can be found at the top of each tab and in the notes attached to the relevant input cells. "]
[null,"Outputs Tab","•  Provide inputs on the type of waste for which the gate fee is to be calculated, and whether yard waste and purchased bulking agent are to be included in the waste diversion estimates.\n"]
[null,"Help"]
[null,"If you need assistance while using the model, please send any questions to BiogasToolkit@epa.gov."]
[null,"Tool Limitations"]
[null,"Facility performance (e.g., electricity and compost production, water demand, wastewater generation, equipment lifespan, operating days/year) is based on published data for typical facilities and will vary based on a number of factors, including, but not limited to, operating and maintenance (O&M) practices, feedstock characteristics, selected technology, and climate.\n\n"]
[null,"Tool Assumptions"]
{"$rows_left_out":2}
{"sheet":"5-Facility Inputs","index":6,"n_rows":202,"n_cols":6,"rows_kept":202,"cut":false,"hidden":false,"merged":[[3,1,4,1],[3,2,4,3],[7,1,7,4],[30,1,30,2],[10,1,10,4]]}
[]
[null,"Facility Inputs - Design Parameters for New Facility"]
[]
[null,"Instructions: ","- Enter design parameters into the blue cells, or select values from the drop-down menus, for facility(ies) the user is interested in developing and/or comparing.\n- User may alter given default values if desired. \n- Input cells will change to light blue once user has entered desired parameters; default cells will change to dark brown if value is altered. "]
[]
[]
[null,"Technology Selection"]
[null,"Please choose \"Yes\" in the dropdown list for the technologies you are interested in developing/ comparing. If you are not interested in the technology, please choose \"No.\""]
[null,"Composting Without Forced Aeration","CHOOSE ONE"]
[null,"Composting With Forced Aeration","CHOOSE ONE"]
[null,{"$f":"IF(AND(C9<>\"Yes\",C10<>\"Yes\"),\"ERROR - Please choose 'Yes' for at least one technology.\", \"\")","v":"ERROR - Please choose 'Yes' for at least one technology."}]
[]
[null,"Facility Operations",null,null,null,"Units"]
[null,"Investment Year"]
[null,"Construction Period",null,null,null,"Years"]
{"$rows_left_out":188}
{"sheet":"6-Waste Inputs","index":7,"n_rows":76,"n_cols":12,"rows_kept":76,"cut":false,"hidden":false,"merged":[[38,2,38,3],[3,3,8,7],[3,2,8,2],[33,2,33,3],[34,2,34,3],[17,4,17,11],[15,2,15,11],[16,2,16,11]]}
[]
[null,null,"Waste Inputs - Feedstock Characteristics"]
[]
[null,null,"Instructions: ","- User should enter tonnes/year of available feedstock in the first table (\"ALL SCENARIOS\") and the projected growth rate of waste in the  \"Total Incoming Feedstock\" table, regardless of which technology user intends to pursue. Feedstock characteristics will vary by location and season.  \n- Input cells will change to light blue once user has entered local data. \n- User may choose to use default feedstock characteristics or enter data from laboratory analysis into the yellow-green cells. \n- Default cells will change to dark brown if value is altered. \n- Based on feedstock blending calculations, user should modify the amount of purchased bulking agent required to meet the target values in red, which are unique to each type of technology. If target values are not met, cell will be highlighted in red."]
[]
[]
[]
[]
[]
[]
[]
[]
[]
[null,null,null,null,null,null,null,"Purchased Bulking Agent for Compost  (e.g., Woo+H14d Chips) "]
[]
{"$rows_left_out":62}
{"sheet":"7-Economic Inputs","index":8,"n_rows":481,"n_cols":12,"rows_kept":481,"cut":false,"hidden":false,"merged":[[3,2,5,6],[3,1,5,1],[47,7,47,9],[8,1,8,4],[8,7,8,10]]}
[]
[null,"Economic Inputs - Costs, Revenues, & Financial Parameters"]
[]
[null,"Instructions: "]
[]
[]
[]
[]
[null,"PROJECT COSTS",null,null,null,"Units",null,"PROJECT REVENUES",null,null,null,"Units"]
[null,"ENTER ALL COSTS IN US DOLLARS",null,null,null,null,null,"ENTER ALL COSTS IN US DOLLARS"]
[null,"Labor ($ in Current Year)",null,null,null,null,null,"Facility Operations ($ in Current Year)"]
[null,"Manager/Engineer - Labor Cost per Person",null,null,null,"$/person/year",null,"Gate Fee (Tipping Fee) to be Charged - Yard Wastes",null,null,null,"$/tonne"]
[null,"Operator - Labor Cost per Person",null,null,null,"$/person/year",null,"Gate Fee (Tipping Fee) to be Charged - Food Wastes",null,null,null,"$/tonne"]
[null,"Total Number of Managers/Engineers",null,null,null,"Full-time Employees",null,"Gate Fee (Tipping Fee) to be Charged - Manure/Sludge",null,null,null,"$/tonne"]
[null,"Total Number of Operators",null,null,null,"Full-time Employees",null,"Gate Fee (Tipping Fee) to be Charged - Paper/Cardboard",null,null,null,"$/tonne"]
{"$rows_left_out":467}
{"sheet":"8-Default Values","index":9,"n_rows":67,"n_cols":6,"rows_kept":67,"cut":false,"hidden":false,"merged":[[3,1,4,1],[3,2,4,7]]}
[]
[null,"Default Values"]
[]
[null,"Instructions:"]
[]
[]
[]
[]
[]
[null,"Technology","Composting Without Forced Aeration","Composting With Forced Aeration"]
[null,"Soil Product Selected","Compost","Compost"]
[null,"Facility Design Capacity",{"$f":"IF(C13=0,0,YardWasteTonnes*(1+WasteGrowthRate)^'5-Facility Inputs'!D27)","v":0},{"$f":"IF(D13=0,0,SUM(YardWasteTonnes:BulkingAgentTonnesForCompost)*(1+WasteGrowthRate)^'5-Facility Inputs'!E27)","v":0}]
[null,"Total Annual Waste to Composting in YR 1 of Operations ",{"$f":"'10-Compost W.O. FA'!D25","v":0},{"$f":"'11-Compost With FA'!D25","v":0}]
[null,"Scenario"]
[null,"Facility Operations",1E-4,8.0000000000000007E-5]
{"$rows_left_out":53}
{"sheet":"9-Outputs","index":10,"n_rows":38,"n_cols":8,"rows_kept":38,"cut":false,"hidden":false,"merged":[[3,1,4,1],[3,2,4,4]]}
[]
[null,"Outputs"]
[]
[null,"Guidance: ","This sheet summarizes and visualizes some basic information about the project based on user inputs from tab “5-Faculty Inputs,” “6-Waste Inputs,” “7-Economic Inputs,” and “8-Default Values.”  "]
[]
[]
[]
[null,"Composting Without Forced Aeration",null,"USD",null,"Composting With Forced Aeration",null,"USD"]
[null,"(e.g., mattress/bed, windrow)",null,null,null,"(e.g., semi-permeable cover, container/box/tunnel, tower, drum)"]
[null,"Initial Capital Investment ($)",null,{"$f":"IF(ISERROR(ROUNDUP('10-Compost W.O. FA'!D39,-2)),0,ROUNDUP('10-Compost W.O. FA'!D39,-2))","v":0},null,"Initial Capital Investment ($)",null,{"$f":"IF(ISERROR(ROUNDUP('11-Compost With FA'!D39,-2)),0,ROUNDUP('11-Compost With FA'!D39,-2))","v":0}]
[null,"Capex/tonne ($/TPY)",null,{"$f":"IF(ISERROR(ROUNDUP(D10/D17,0)),0,ROUNDUP(D10/D17,0))","v":0},null,"Capex/tonne ($/TPY)",null,{"$f":"IF(ISERROR(ROUNDUP(H10/H17,0)),0,ROUNDUP(H10/H17,0))","v":0}]
[null,"Total Annual Expenses in YR 1 Operations ($/year)",null,{"$f":"IF(ISERROR(ROUNDUP(MIN('10-Compost W.O. FA'!E227:X227),-2)),0,ROUNDUP(MIN('10-Compost W.O. FA'!E227:X227),-2))","v":0},null,"Total Annual Expenses in YR 1 Operations ($/year)",null,{"$f":"IF(ISERROR(ROUNDUP(MIN('11-Compost With FA'!D227:Z227),-2)),0,ROUNDUP(MIN('11-Compost With FA'!D227:Z227),-2))","v":0}]
[null,"O&M/tonne in YR 1 Operations ($/tonne of waste processed)",null,{"$f":"IF(ISERROR(ROUNDUP(D12/(D15+D16),0)),0,ROUNDUP(D12/(D15+D16),0))","v":0},null,"O&M/tonne in YR 1 Operations ($/tonne of waste processed)",null,{"$f":"IF(ISERROR(ROUNDUP(H12/(H15+H16),0)),0,ROUNDUP(H12/(H15+H16),0))","v":0}]
[null,"Total Land Required (ha)",null,{"$f":"'10-Compost W.O. FA'!D29","v":0},null,"Total Land Required (ha)",null,{"$f":"'11-Compost With FA'!D29","v":0}]
[null,"Total Organic Waste Available in YR 1 (tonnes/year)",null,{"$f":"FeedstockAvailability","v":0},null,"Total Organic Waste Available in YR 1 (tonnes/year)",null,{"$f":"FeedstockAvailability","v":0}]
{"$rows_left_out":24}
{"sheet":"10-Compost W.O. FA","index":11,"n_rows":445,"n_cols":26,"rows_kept":445,"cut":false,"hidden":false,"merged":[[229,1,229,4],[230,1,230,4],[3,1,4,1],[3,2,4,4],[57,3,57,4],[58,1,58,4]]}
[]
[null,"Composting Without Forced Aeration"]
[]
[null,"Guidance: ","This sheet shows the hypothetical project’s estimated annual Income Statement and Balance Sheet, which are used to determine the Internal Rate of Return (IRR). The IRR is the rate that the modeled project’s cash flows break even with initial investment. IRR is determined by setting the net present value of all cash flows (both positive and negative) from the investment equal to zero. Note this model estimates Equity IRR. \nTo estimate Project IRR please set total debt on the “7-Economic Inputs” tab equal to zero. The sheet is organized by first listing important assumptions based on user inputs from tab “5-Faculty Inputs,” “6-Waste Inputs,” “7-Economic Inputs,” and “8-Default Values.” Below this are estimated project costs and revenues, debt schedules, interest, depreciation, and other important information. "]
[]
[]
[null,"Key Inputs"]
[null,"Compost Sale Price",null,{"$f":"CompostMarketPrice","v":0},"$/tonne"]
[null,"Gate Fee - Yard Waste ",null,{"$f":"GateFeeYardWaste","v":0},"$/tonne"]
[null,"Gate Fee - Food Waste",null,{"$f":"GateFeeFoodWaste","v":0},"$/tonne"]
[null,"Gate Fee - Manure/Sludge Waste",null,{"$f":"GateFeeManure","v":0},"$/tonne"]
[null,"Gate Fee - Paper/Cardboard",null,{"$f":"GateFeePaper","v":0},"$/tonne"]
[]
[null,"Composting Facility Assumptions ",null,null,"Units"]
[null,"Equipment Lifespan",null,{"$f":"DepreciationComposting","v":7},"years"]
{"$rows_left_out":431}
{"sheet":"11-Compost With FA","index":12,"n_rows":445,"n_cols":26,"rows_kept":445,"cut":false,"hidden":false,"merged":[[3,1,4,1],[3,2,4,4],[58,1,58,4]]}
[]
[null,"Composting With Forced Aeration"]
[]
[null,"Guidance: ","This sheet shows the hypothetical project’s estimated annual Income Statement and Balance Sheet, which are used to determine the Internal Rate of Return (IRR). The IRR is the rate that the modeled project’s cash flows break even with initial investment. IRR is determined by setting the net present value of all cash flows (both positive and negative) from the investment equal to zero. Note this model estimates Equity IRR. To estimate Project IRR please set total debt on the “7-Economic Inputs” tab equal to zero. The sheet is organized by first listing important assumptions based on user inputs from tab “5-Faculty Inputs,” “6-Waste Inputs,” “7-Economic Inputs,” and “8-Default Values.” Below this are estimated project costs and revenues, debt schedules, interest, depreciation, and other important information. "]
[]
[]
[null,"Key Outputs"]
[null,"Compost Sale Price",null,{"$f":"CompostMarketPrice","v":0},"$/tonne"]
[null,"Gate Fee - Yard Waste",null,{"$f":"GateFeeYardWaste","v":0},"$/tonne"]
[null,"Gate Fee - Food Waste",null,{"$f":"GateFeeFoodWaste","v":0},"$/tonne"]
[null,"Gate Fee - Manure/Sludge Waste",null,{"$f":"GateFeeManure","v":0},"$/tonne"]
[null,"Gate Fee - Paper/Cardboard",null,{"$f":"GateFeePaper","v":0},"$/tonne"]
[]
[null,"Composting Facility Assumptions ",null,null,"Units"]
[null,"Equipment Lifespan",null,{"$f":"DepreciationComposting","v":7},"years"]
{"$rows_left_out":431}
{"sheet":"12-Tool Assumptions","index":13,"n_rows":13,"n_cols":6,"rows_kept":13,"cut":false,"hidden":false,"merged":[[3,1,4,1],[3,3,4,3]]}
[]
[null,"Tool Assumptions"]
[]
[null,"Guidance: ",null,"This tab provides a list of additional assumptions used throughout the model, and their sources."]
[]
[]
[null,null,null,"Assumption",null,"Source"]
[null,1,null,"Revenues and expenses are projected over the same 20-year operating period for all technologies. The tool can tolerate construction periods greater than 1 and less than 3 years. "]
[null,2,null,"When electing to finance the purchase of replacement composting equipment, short-term debt and equity assumptions applied to the initial investment are also applied to all replacement equipment purchases over the life of the project."]
[null,3,null,"When electing to purchase land, it is assumed that the land is financed along with the facility, but is sold at the end of the project life. The value of the land is inflated at the general rate of inflation."]
[null,4,null,"Interest does not accrue during the construction period. Debt service begins in YR 1 of operations."]
[null,5,null,"Compost sale prices assume bulk material sales. "]
[null,6,null,"Maintenance and insurance expenses are calculated as a percentage of capex prior to contingencies being added in."]

{"sheet":"13-Sources","index":14,"n_rows":35,"n_cols":3,"rows_kept":35,"cut":false,"hidden":false,"merged":[[1,1,1,2]]}
[]
[null,"Sources"]
[]
[null,null,"Source"]
[null,1,"Angelonidi, Eleni and Stephen R. Smith. \"A Comparison of Wet and Dry Anaerobic Digestion Processes for the Treatment of Municipal Solid Waste and Food Waste.\" Water and Environment Journal, 29, 2015. pp. 549-557."]
[null,{"$f":"B5+1","v":2},"Agri-Food and Biosciences Institute, Peter Frost and Stephen Gilkinson. August 2010. \"FIRST 18 MONTH PERFORMANCE SUMMARY FOR ANAEROBIC DIGESTION OF DAIRY COW SLURRY AT\nAFBI HILLSBOROUGH.\""]
[null,{"$f":"B6+1","v":3},"Bioferm Energy Systems. \"Anaerobic Digestion FAQ\". Bioferm Energy Systems. n.d. Accssed August 2014."]
[null,{"$f":"B7+1","v":4},"Blair, Charlie. \"Energy from Waste Potential in Scotland.\" January 2010.  https://www.webarchive.org.uk/wayback/archive/3000/https://www.gov.scot/resource/doc/311011/0098129.pdf. Accessed December 2014."]
[null,5,"Chastain, John P. and James J. Camberato. \"Dairy Manure Production and Nutrient Content.\" Confined Animal Manure Manager Certification Program Manual: Dairy Version, 2004."]
[null,6,"Crowe, Matt, Kirsty Nolan, Caitríona Collins, Gerry Carty, Brian Donlon, Merete Kristoffersen, Morten Brøgger, Morten Carlsbæk, Reto Michael Hummelshøj, and Claus Dahl Thomsen (European Topic Centre on Waste). \"Biodegradable Municipal Waste\nManagement in Europe Part 3: Technology and Market Issues.\" January 2002. https://www.eea.europa.eu/publications/topic_report_2001_15_Part3. Accessed July 2014."]
[null,7,"Eunomia Research & Consulting. \"Annexes.\" Costs for Municipal Waste Management in the EU. European Commission, 2002. Web."]
[null,8,"Fachagentur Nachwachsende Rohstoffe (FNR). Biogas: An Introduction. 2013. https://www.fnr.de/fileadmin/Projekte/2021/Mediathek/brosch.biogas-2013-en-web-pdf.pdf."]
[null,9,"Goldstein, Nora. \"High Solids Anaerobic Digestion and Composting in San Jose.\" Biocycle Magazine, March/April 2014, https://www.biocycle.net/2014/03/28/high-solids-anaerobic-digestion-composting-in-san-jose/. Accessed October 2014."]
[null,10,"Italian Composting and Biogas Association. Biogas e Compost: da rifiuti organici selezionati. October 2011. https://www.compost.it/attachments/604_CIC_biogas_e_compost_2011_definitivo.pdf"]
[null,11,"Italian Composting and Biogas Association. July 2014."]
{"$rows_left_out":21}
{"sheet":"25-Misc","index":15,"n_rows":27,"n_cols":10,"rows_kept":27,"cut":false,"hidden":true,"merged":[[1,1,1,4],[9,1,9,4]]}
[]
[null,"TPY"]
["Wet AD",20000,40000,60000,80000,null,20000,40000,60000,80000]
["Min Capex",5000000,7000000,8000000,9000000,null,{"$f":"B4*1.29","v":6450000},{"$f":"C4*1.29","v":9030000},10320000,11610000]
["Min Capex/Tonne",{"$f":"B4/B3","v":250},{"$f":"C4/C3","v":175},{"$f":"D4/D3","v":133.33333333333334},{"$f":"E4/E3","v":112.5},null,{"$f":"B5*1.29","v":322.5},225.75,172.00000000000003,145.125]
["Max Capex",{"$f":"B7*B3","v":6000000},{"$f":"C7*C3","v":11000000},{"$f":"D7*D3","v":15000000},{"$f":"E7*E3","v":16000000},null,{"$f":"B6*1.29","v":7740000},14190000,19350000,20640000]
["Max Capex/Tonne",{"$f":"300","v":300},{"$f":"275","v":275},{"$f":"250","v":250},{"$f":"200","v":200},null,{"$f":"B7*1.29","v":387},354.75,322.5,258]
[]
["% Cheaper",0.1]
[null,"TPY"]
["Dry AD",20000,40000,60000,80000,null,20000,40000,60000,80000]
["Min Capex",{"$f":"B4*(1-$B$9)","v":4500000},{"$f":"C4*(1-$B$9)","v":6300000},{"$f":"D4*(1-$B$9)","v":7200000},{"$f":"E4*(1-$B$9)","v":8100000},null,{"$f":"B12*1.29","v":5805000},{"$f":"C12*1.29","v":8127000},9288000,10449000]
["Min Capex/Tonne",{"$f":"B12/B11","v":225},{"$f":"C12/C11","v":157.5},{"$f":"D12/D11","v":120},{"$f":"E12/E11","v":101.25},null,{"$f":"B13*1.29","v":290.25},203.17500000000001,154.80000000000001,130.61250000000001]
["Max Capex",{"$f":"B6*(1-$B$9)","v":5400000},{"$f":"C6*(1-$B$9)","v":9900000},{"$f":"D6*(1-$B$9)","v":13500000},{"$f":"E6*(1-$B$9)","v":14400000},null,{"$f":"B14*1.29","v":6966000},12771000,17415000,18576000]
["Max Capex/Tonne",{"$f":"B14/B11","v":270},{"$f":"C14/C11","v":247.5},{"$f":"D14/D11","v":225},{"$f":"E14/E11","v":180},null,{"$f":"B15*1.29","v":348.3},319.27500000000003,290.25,232.20000000000002]
{"$rows_left_out":12}